Reaction Details
Target5-hydroxytryptamine receptor 1A
LigandBDBM50343896
Substrate/Competitorn/a
Meas. Tech.ChEMBL_747433 (CHEMBL1776882)
Ki 0.47±n/a nM
Citation Al Hussainy, RVerbeek, Jvan der Born, DBraker, AHLeysen, JEKnol, RJBooij, JHerscheid, JK Design, synthesis, radiolabeling, and in vitro and in vivo evaluation of bridgehead iodinated analogues of N-{2-[4-(2-methoxyphenyl)piperazin-1-yl]ethyl}-N-(pyridin-2-yl)cyclohexanecarboxamide (WAY-100635) as potential SPECT ligands for the 5-HT1A receptor. J Med Chem54:3480-91 (2011) 
 
5-hydroxytryptamine receptor 1A
Name:5-hydroxytryptamine receptor 1A
Type:n/a
Mol. Mass.:46122.49
Organism:Homo sapiens (Human)
Description:n/a
Residue:422
BDBM50343896
NameBDBM50343896
Synonyms:CHEMBL1774997 | N-(2-(4-(2-Hydroxyphenyl)piperazin-1-yl)ethyl)-4-iodo-N-(pyridin-2-yl)bicyclo[2.2.1]heptane-1-carboxamide
TypeSmall organic molecule
Emp. Form.C25H31IN4O2
Mol. Mass.546.4437
SMILESOc1ccccc1N1CCN(CCN(C(=O)C23CCC(I)(CC2)C3)c2ccccn2)CC1