Reaction Details
TargetMannose-6-phosphate isomerase
LigandBDBM44443
Substrate/Competitorn/a
Meas. Tech.ChEMBL_747525 (CHEMBL1777059)
IC50 1300±n/a nM
Citation Dahl, RBravo, YSharma, VIchikawa, MDhanya, RPHedrick, MBrown, BRascon, JVicchiarelli, MMangravita-Novo, AYang, LStonich, DSu, YSmith, LHSergienko, EFreeze, HHCosford, ND Potent, selective, and orally available benzoisothiazolone phosphomannose isomerase inhibitors as probes for congenital disorder of glycosylation Ia. J Med Chem54:3661-8 (2011) 
 
Mannose-6-phosphate isomerase
Name:Mannose-6-phosphate isomerase
Type:PROTEIN
Mol. Mass.:46651.35
Organism:Homo sapiens (Human)
Description:ChEMBL_1448919
Residue:423
BDBM44443
NameBDBM44443
Synonyms:2-[1,3-bis(oxidanylidene)isoindol-2-yl]-N-[3-cyano-4,5-bis(furan-2-yl)furan-2-yl]-4-methyl-pentanamide N-[3-cyano-4,5-bis(2-furanyl)-2-furanyl]-2-(1,3-dioxo-2-isoindolyl)-4-methylpentanamide N-[3-cyano-4,5-bis(furan-2-yl)furan-2-yl]-2-(1,3-dioxoisoindol-2-yl)-4-methylpentanamide cid_2998795
TypeSmall organic molecule
Emp. Form.C27H21N3O6
Mol. Mass.483.4721
SMILESCC(C)CC(N1C(=O)c2ccccc2C1=O)C(=O)Nc1oc(-c2ccco2)c(-c2ccco2)c1C#N