Reaction Details
TargetMannose-6-phosphate isomerase
LigandBDBM44445
Substrate/Competitorn/a
Meas. Tech.ChEMBL_747525 (CHEMBL1777059)
IC50 1900±n/a nM
Citation Dahl, RBravo, YSharma, VIchikawa, MDhanya, RPHedrick, MBrown, BRascon, JVicchiarelli, MMangravita-Novo, AYang, LStonich, DSu, YSmith, LHSergienko, EFreeze, HHCosford, ND Potent, selective, and orally available benzoisothiazolone phosphomannose isomerase inhibitors as probes for congenital disorder of glycosylation Ia. J Med Chem54:3661-8 (2011) 
 
Mannose-6-phosphate isomerase
Name:Mannose-6-phosphate isomerase
Type:PROTEIN
Mol. Mass.:46651.35
Organism:Homo sapiens (Human)
Description:ChEMBL_1448919
Residue:423
BDBM44445
NameBDBM44445
Synonyms:3-(1,3-benzodioxol-5-ylmethyl)-7-(piperidin-1-ylcarbonyl)-2-thioxo-2,3-dihydroquinazolin-4(1H)-one 3-(1,3-benzodioxol-5-ylmethyl)-7-[oxo(1-piperidinyl)methyl]-2-sulfanylidene-1H-quinazolin-4-one 7-(piperidine-1-carbonyl)-3-piperonyl-2-thioxo-1H-quinazolin-4-one SMR000031083 | cid_3237126
TypeSmall organic molecule
Emp. Form.C22H21N3O4S
Mol. Mass.423.485
SMILESO=C(N1CCCCC1)c1ccc2c(c1)[nH]c(=S)n(Cc1ccc3OCOc3c1)c2=O