Reaction Details
TargetAurora kinase A
LigandBDBM50343936
Substrate/Competitorn/a
Meas. Tech.ChEMBL_748278 (CHEMBL1781288)
Ki 310±n/a nM
Citation Ando, RIkegami, HSakiyama, MOoike, SHayashi, MFujino, YAbe, DNakamura, HMishina, TKato, HIwase, YTomozane, HMorioka, M 3-Cyano-6-(5-methyl-3-pyrazoloamino)pyridines: selective Aurora A kinase inhibitors. Bioorg Med Chem Lett20:4709-11 (2010) 
 
Aurora kinase A
Name:Aurora kinase A
Type:Serine/threonine-protein kinase
Mol. Mass.:45830.98
Organism:Homo sapiens (Human)
Description:O14965
Residue:403
BDBM50343936
NameBDBM50343936
Synonyms:CHEMBL1780256 | N-(4-(3-cyano-6-(5-methyl-1H-pyrazol-3-ylamino)-4-phenylpyridin-2-ylthio)phenyl)isobutyramide
TypeSmall organic molecule
Emp. Form.C26H24N6OS
Mol. Mass.468.573
SMILESCC(C)C(=O)Nc1ccc(Sc2nc(Nc3cc(C)n[nH]3)cc(-c3ccccc3)c2C#N)cc1