Reaction Details
TargetAurora kinase A
LigandBDBM50343939
Substrate/Competitorn/a
Meas. Tech.ChEMBL_748278 (CHEMBL1781288)
Ki 0.590000±n/a nM
Citation Ando, RIkegami, HSakiyama, MOoike, SHayashi, MFujino, YAbe, DNakamura, HMishina, TKato, HIwase, YTomozane, HMorioka, M 3-Cyano-6-(5-methyl-3-pyrazoloamino)pyridines: selective Aurora A kinase inhibitors. Bioorg Med Chem Lett20:4709-11 (2010) 
 
Aurora kinase A
Name:Aurora kinase A
Type:Serine/threonine-protein kinase
Mol. Mass.:45830.98
Organism:Homo sapiens (Human)
Description:O14965
Residue:403
BDBM50343939
NameBDBM50343939
Synonyms:(S)-2-(6-hydroxy-6-methylheptan-2-ylamino)-4-methyl-6-(5-methyl-1H-pyrazol-3-ylamino)nicotinonitrile | CHEMBL1778663
TypeSmall organic molecule
Emp. Form.C19H28N6O
Mol. Mass.356.4652
SMILESC[C@@H](CCCC(C)(C)O)Nc1nc(Nc2cc(C)n[nH]2)cc(C)c1C#N