Reaction Details
TargetAurora kinase A
LigandBDBM50343944
Substrate/Competitorn/a
Meas. Tech.ChEMBL_748278 (CHEMBL1781288)
Ki 20±n/a nM
Citation Ando, RIkegami, HSakiyama, MOoike, SHayashi, MFujino, YAbe, DNakamura, HMishina, TKato, HIwase, YTomozane, HMorioka, M 3-Cyano-6-(5-methyl-3-pyrazoloamino)pyridines: selective Aurora A kinase inhibitors. Bioorg Med Chem Lett20:4709-11 (2010) 
 
Aurora kinase A
Name:Aurora kinase A
Type:Serine/threonine-protein kinase
Mol. Mass.:45830.98
Organism:Homo sapiens (Human)
Description:O14965
Residue:403
BDBM50343944
NameBDBM50343944
Synonyms:2-(2-hydroxyethylamino)-4-methyl-6-(5-methyl-1H-pyrazol-3-ylamino)nicotinonitrile | CHEMBL1777839
TypeSmall organic molecule
Emp. Form.C13H16N6O
Mol. Mass.272.3057
SMILESCc1cc(Nc2cc(C)c(C#N)c(NCCO)n2)[nH]n1