Reaction Details
TargetAurora kinase A
LigandBDBM50343946
Substrate/Competitorn/a
Meas. Tech.ChEMBL_748278 (CHEMBL1781288)
Ki 9.7±n/a nM
Citation Ando, RIkegami, HSakiyama, MOoike, SHayashi, MFujino, YAbe, DNakamura, HMishina, TKato, HIwase, YTomozane, HMorioka, M 3-Cyano-6-(5-methyl-3-pyrazoloamino)pyridines: selective Aurora A kinase inhibitors. Bioorg Med Chem Lett20:4709-11 (2010) 
 
Aurora kinase A
Name:Aurora kinase A
Type:Serine/threonine-protein kinase
Mol. Mass.:45830.98
Organism:Homo sapiens (Human)
Description:O14965
Residue:403
BDBM50343946
NameBDBM50343946
Synonyms:2-(6-hydroxy-6-methylheptylthio)-4-methyl-6-(5-methyl-1H-pyrazol-3-ylamino)nicotinonitrile | CHEMBL1778660
TypeSmall organic molecule
Emp. Form.C19H27N5OS
Mol. Mass.373.516
SMILESCc1cc(Nc2cc(C)c(C#N)c(SCCCCCC(C)(C)O)n2)[nH]n1