Reaction Details
TargetRAF proto-oncogene serine/threonine-protein kinase
LigandBDBM50343948
Substrate/Competitorn/a
Meas. Tech.ChEMBL_748324 (CHEMBL1781448)
IC50 27±n/a nM
Citation Duffey, MOAdams, RBlackburn, CChau, RWChen, SGalvin, KMGarcia, KGould, AEGreenspan, PDHarrison, SHuang, SCKim, MSKulkarni, BLangston, SLiu, JXMa, LTMenon, SNagayoshi, MRowland, RSVos, TJXu, TYang, JJYu, SZhang, Q Discovery and optimization of pyrazoline compounds as B-Raf inhibitors. Bioorg Med Chem Lett20:4800-4 (2010) 
 
RAF proto-oncogene serine/threonine-protein kinase
Name:RAF proto-oncogene serine/threonine-protein kinase
Type:Serine/threonine-protein kinase
Mol. Mass.:73082.52
Organism:Homo sapiens (Human)
Description:P04049
Residue:648
BDBM50343948
NameBDBM50343948
Synonyms:(5-(2-hydroxyphenyl)-3-(pyridin-3-yl)-4,5-dihydro-1H-pyrazol-1-yl)(5-(pyridin-2-yl)thiophen-2-yl)methanone rac-(5-(2-hydroxyphenyl)-3-(pyridin-3-yl)-4,5-dihydro-1H-pyrazol-1-yl)(5-(pyridin-2-yl)thiophen-2-yl)methanone
TypeSmall organic molecule
Emp. Form.C24H18N4O2S
Mol. Mass.426.49
SMILESOc1ccccc1C1CC(=NN1C(=O)c1ccc(s1)-c1ccccn1)c1cccnc1