Reaction Details
TargetDisintegrin and metalloproteinase domain-containing protein 17
LigandBDBM50343963
Substrate/Competitorn/a
Meas. Tech.ChEMBL_748329 (CHEMBL1781453)
Ki 3±n/a nM
Citation Li, DPopovici-Muller, JBelanger, DBCaldwell, JDai, CDavid, MGirijavallabhan, VMLavey, BJLee, JFLiu, ZMazzola, RRizvi, RRosner, KEShankar, BSpitler, JTing, PCVaccaro, HYu, WZhou, GZhu, ZNiu, XSun, JGuo, ZOrth, PChen, SKozlowski, JALundell, DJMadison, VMcKittrick, BPiwinski, JJShih, NYShipps, GWSiddiqui, MAStrickland, CO Structure and activity relationships of tartrate-based TACE inhibitors. Bioorg Med Chem Lett20:4812-5 (2010) 
 
Disintegrin and metalloproteinase domain-containing protein 17
Name:Disintegrin and metalloproteinase domain-containing protein 17
Type:Enzyme
Mol. Mass.:93007.89
Organism:Homo sapiens (Human)
Description:
Residue:824
BDBM50343963
NameBDBM50343963
Synonyms:(2R,3R)-4-((R)-2-(3-chlorophenyl)pyrrolidin-1-yl)-2,3-dihydroxy-N-((5-(2-methoxybenzyl)thiophen-2-yl)methyl)-4-oxobutanamide | CHEMBL1779598
TypeSmall organic molecule
Emp. Form.C27H29ClN2O5S
Mol. Mass.529.048
SMILESCOc1ccccc1Cc1ccc(CNC(=O)[C@H](O)[C@@H](O)C(=O)N2CCC[C@@H]2c2cccc(Cl)c2)s1