Reaction Details
TargetDisintegrin and metalloproteinase domain-containing protein 17
LigandBDBM50343965
Substrate/Competitorn/a
Meas. Tech.ChEMBL_748329 (CHEMBL1781453)
Ki 37±n/a nM
Citation Li, DPopovici-Muller, JBelanger, DBCaldwell, JDai, CDavid, MGirijavallabhan, VMLavey, BJLee, JFLiu, ZMazzola, RRizvi, RRosner, KEShankar, BSpitler, JTing, PCVaccaro, HYu, WZhou, GZhu, ZNiu, XSun, JGuo, ZOrth, PChen, SKozlowski, JALundell, DJMadison, VMcKittrick, BPiwinski, JJShih, NYShipps, GWSiddiqui, MAStrickland, CO Structure and activity relationships of tartrate-based TACE inhibitors. Bioorg Med Chem Lett20:4812-5 (2010) 
 
Disintegrin and metalloproteinase domain-containing protein 17
Name:Disintegrin and metalloproteinase domain-containing protein 17
Type:Enzyme
Mol. Mass.:93007.89
Organism:Homo sapiens (Human)
Description:
Residue:824
BDBM50343965
NameBDBM50343965
Synonyms:(2R,3R)-N-((5-((1H-imidazol-1-yl)methyl)thiophen-2-yl)methyl)-4-((R)-2-(3-chlorophenyl)pyrrolidin-1-yl)-2,3-dihydroxy-4-oxobutanamide | CHEMBL1779600
TypeSmall organic molecule
Emp. Form.C23H25ClN4O4S
Mol. Mass.488.987
SMILESO[C@H]([C@@H](O)C(=O)N1CCC[C@@H]1c1cccc(Cl)c1)C(=O)NCc1ccc(Cn2ccnc2)s1