Reaction Details
TargetDisintegrin and metalloproteinase domain-containing protein 17
LigandBDBM50343968
Substrate/Competitorn/a
Meas. Tech.ChEMBL_748329 (CHEMBL1781453)
Ki 45±n/a nM
Citation Li, DPopovici-Muller, JBelanger, DBCaldwell, JDai, CDavid, MGirijavallabhan, VMLavey, BJLee, JFLiu, ZMazzola, RRizvi, RRosner, KEShankar, BSpitler, JTing, PCVaccaro, HYu, WZhou, GZhu, ZNiu, XSun, JGuo, ZOrth, PChen, SKozlowski, JALundell, DJMadison, VMcKittrick, BPiwinski, JJShih, NYShipps, GWSiddiqui, MAStrickland, CO Structure and activity relationships of tartrate-based TACE inhibitors. Bioorg Med Chem Lett20:4812-5 (2010) 
 
Disintegrin and metalloproteinase domain-containing protein 17
Name:Disintegrin and metalloproteinase domain-containing protein 17
Type:Enzyme
Mol. Mass.:93007.89
Organism:Homo sapiens (Human)
Description:
Residue:824
BDBM50343968
NameBDBM50343968
Synonyms:(2R,3R)-N-((4-benzylthiophen-2-yl)methyl)-4-(2-(3-chlorophenyl)pyrrolidin-1-yl)-2,3-dihydroxy-4-oxobutanamide | CHEMBL1779631
TypeSmall organic molecule
Emp. Form.C26H27ClN2O4S
Mol. Mass.499.022
SMILESO[C@H]([C@@H](O)C(=O)N1CCCC1c1cccc(Cl)c1)C(=O)NCc1cc(Cc2ccccc2)cs1