Reaction Details
TargetDisintegrin and metalloproteinase domain-containing protein 17
LigandBDBM50343974
Substrate/Competitorn/a
Meas. Tech.ChEMBL_748329 (CHEMBL1781453)
Ki 9±n/a nM
Citation Li, DPopovici-Muller, JBelanger, DBCaldwell, JDai, CDavid, MGirijavallabhan, VMLavey, BJLee, JFLiu, ZMazzola, RRizvi, RRosner, KEShankar, BSpitler, JTing, PCVaccaro, HYu, WZhou, GZhu, ZNiu, XSun, JGuo, ZOrth, PChen, SKozlowski, JALundell, DJMadison, VMcKittrick, BPiwinski, JJShih, NYShipps, GWSiddiqui, MAStrickland, CO Structure and activity relationships of tartrate-based TACE inhibitors. Bioorg Med Chem Lett20:4812-5 (2010) 
 
Disintegrin and metalloproteinase domain-containing protein 17
Name:Disintegrin and metalloproteinase domain-containing protein 17
Type:Enzyme
Mol. Mass.:93007.89
Organism:Homo sapiens (Human)
Description:
Residue:824
BDBM50343974
NameBDBM50343974
Synonyms:CHEMBL1779607 | rac-(2R,3R)-2,3-dihydroxy-N-((5-((2-methyl-1H-benzo[d]imidazol-1-yl)methyl)thiophen-2-yl)methyl)-4-oxo-4-(2-(thiazol-2-yl)pyrrolidin-1-yl)butanamide
TypeSmall organic molecule
Emp. Form.C25H27N5O4S2
Mol. Mass.525.643
SMILESCc1nc2ccccc2n1Cc1ccc(CNC(=O)[C@H](O)[C@@H](O)C(=O)N2CCCC2c2nccs2)s1