Reaction Details
TargetMelatonin receptor type 1B
LigandBDBM50343991
Substrate/Competitorn/a
Meas. Tech.ChEMBL_748405 (CHEMBL1781569)
Ki 0.24±n/a nM
Citation Mésangeau, CFraise, MDelagrange, PCaignard, DHBoutin, JABerthelot, PYous, S Preparation and pharmacological evaluation of a novel series of 2-(phenylthio)benzo[b]thiophenes as selective MT2 receptor ligands. Eur J Med Chem46:1835-40 (2011) 
 
Melatonin receptor type 1B
Name:Melatonin receptor type 1B
Type:Enzyme
Mol. Mass.:40203.54
Organism:Homo sapiens (Human)
Description:P49286
Residue:362
BDBM50343991
NameBDBM50343991
Synonyms:CHEMBL1779810 | N-(2-(5-fluoro-2-(4-fluorophenylthio)benzo[b]thiophen-3-yl)ethyl)but-3-enamide
TypeSmall organic molecule
Emp. Form.C20H17F2NOS2
Mol. Mass.389.482
SMILESFc1ccc(Sc2sc3ccc(F)cc3c2CCNC(=O)CC=C)cc1