Reaction Details
TargetHigh affinity cAMP-specific and IBMX-insensitive 3',5'-cyclic phosphodiesterase 8B
LigandBDBM50344022
Substrate/Competitorn/a
Meas. Tech.ChEMBL_748479 (CHEMBL1780332)
IC50 3.86±n/a nM
Citation DeNinno, MPWright, SWVisser, MSEtienne, JBMoore, DEOlson, TVRocke, BNAndrews, MPZarbo, CMillham, MLBoscoe, BPBoyer, DDDoran, SDHouseknecht, KL 1,5-Substituted nipecotic amides: selective PDE8 inhibitors displaying diastereomer-dependent microsomal stability. Bioorg Med Chem Lett21:3095-8 (2011) 
 
High affinity cAMP-specific and IBMX-insensitive 3',5'-cyclic phosphodiesterase 8B
Name:High affinity cAMP-specific and IBMX-insensitive 3',5'-cyclic phosphodiesterase 8B
Type:PROTEIN
Mol. Mass.:98984.88
Organism:Homo sapiens (Human)
Description:ChEMBL_876321
Residue:885
BDBM50344022
NameBDBM50344022
Synonyms:CHEMBL1780100 | trans-(3S,5S)-5-(3-methyl-1,2,4-oxadiazol-5-yl)-1-((5-methyl-2-phenyloxazol-4-yl)methyl)-N-((6-methylpyridin-2-yl)methyl)piperidine-3-carboxamide
TypeSmall organic molecule
Emp. Form.C27H30N6O3
Mol. Mass.486.5655
SMILESCc1noc(n1)[C@H]1C[C@@H](CN(Cc2nc(oc2C)-c2ccccc2)C1)C(=O)NCc1cccc(C)n1