Reaction Details
TargetHigh affinity cAMP-specific and IBMX-insensitive 3',5'-cyclic phosphodiesterase 8B
LigandBDBM50344029
Substrate/Competitorn/a
Meas. Tech.ChEMBL_748479 (CHEMBL1780332)
IC50 7.3±n/a nM
Citation DeNinno, MPWright, SWVisser, MSEtienne, JBMoore, DEOlson, TVRocke, BNAndrews, MPZarbo, CMillham, MLBoscoe, BPBoyer, DDDoran, SDHouseknecht, KL 1,5-Substituted nipecotic amides: selective PDE8 inhibitors displaying diastereomer-dependent microsomal stability. Bioorg Med Chem Lett21:3095-8 (2011) 
 
High affinity cAMP-specific and IBMX-insensitive 3',5'-cyclic phosphodiesterase 8B
Name:High affinity cAMP-specific and IBMX-insensitive 3',5'-cyclic phosphodiesterase 8B
Type:PROTEIN
Mol. Mass.:98984.88
Organism:Homo sapiens (Human)
Description:ChEMBL_876321
Residue:885
BDBM50344029
NameBDBM50344029
Synonyms:CHEMBL1780084 | trans-(3R,5R)-5-ethyl-1-((5-methyl-2-phenyloxazol-4-yl)methyl)-N-((tetrahydro-2H-pyran-4-yl)methyl)piperidine-3-carboxamide
TypeSmall organic molecule
Emp. Form.C25H35N3O3
Mol. Mass.425.5637
SMILESCC[C@@H]1C[C@H](CN(Cc2nc(oc2C)-c2ccccc2)C1)C(=O)NCC1CCOCC1