Reaction Details
TargetCytochrome P450 1A1
LigandBDBM50344054
Substrate/Competitorn/a
Meas. Tech.ChEMBL_748492 (CHEMBL1780345)
Ki 210±n/a nM
Citation Androutsopoulos, VPPapakyriakou, AVourloumis, DSpandidos, DA Comparative CYP1A1 and CYP1B1 substrate and inhibitor profile of dietary flavonoids. Bioorg Med Chem19:2842-9 (2011) 
 
Cytochrome P450 1A1
Name:Cytochrome P450 1A1
Type:Protein
Mol. Mass.:58177.23
Organism:Homo sapiens (Human)
Description:P04798
Residue:512
BDBM50344054
NameBDBM50344054
Synonyms:3',5-dihydroxy-4',6,7-trimethoxy flavone CHEMBL487402 | eupatorin
TypeSmall organic molecule
Emp. Form.C18H16O7
Mol. Mass.344.3154
SMILESCOc1ccc(cc1O)-c1cc(=O)c2c(O)c(OC)c(OC)cc2o1