Reaction Details
TargetB1 bradykinin receptor
LigandBDBM50344094
Substrate/Competitorn/a
Meas. Tech.ChEMBL_748611 (CHEMBL1780464)
Ki 0.55±n/a nM
Citation Chen, JJNguyen, TD'Amico, DCQian, WHuman, JAya, TBiswas, KFotsch, CHan, NLiu, QNishimura, NPeterkin, TAYang, KZhu, JRiahi, BBHungate, RWAndersen, NGColyer, JTFaul, MMKamassah, AWang, JJona, JKumar, GJohnson, EAskew, BC 3-Oxo-2-piperazinyl acetamides as potent bradykinin B1 receptor antagonists for the treatment of pain and inflammation. Bioorg Med Chem Lett21:3384-9 (2011) 
 
B1 bradykinin receptor
Name:B1 bradykinin receptor
Type:Enzyme
Mol. Mass.:40508.87
Organism:Homo sapiens (Human)
Description:P46663
Residue:353
BDBM50344094
NameBDBM50344094
Synonyms:2-(1-(4-methoxyphenylsulfonyl)-3-oxopiperazin-2-yl)-N-((R)-6-(piperidin-1-ylmethyl)-1,2,3,4-tetrahydronaphthalen-1-yl)acetamide | CHEMBL1777886
TypeSmall organic molecule
Emp. Form.C29H38N4O5S
Mol. Mass.554.701
SMILESCOc1ccc(cc1)S(=O)(=O)N1CCNC(=O)C1CC(=O)N[C@@H]1CCCc2cc(CN3CCCCC3)ccc12