Reaction Details
TargetB1 bradykinin receptor
LigandBDBM50344105
Substrate/Competitorn/a
Meas. Tech.ChEMBL_748611 (CHEMBL1780464)
Ki 442±n/a nM
Citation Chen, JJNguyen, TD'Amico, DCQian, WHuman, JAya, TBiswas, KFotsch, CHan, NLiu, QNishimura, NPeterkin, TAYang, KZhu, JRiahi, BBHungate, RWAndersen, NGColyer, JTFaul, MMKamassah, AWang, JJona, JKumar, GJohnson, EAskew, BC 3-Oxo-2-piperazinyl acetamides as potent bradykinin B1 receptor antagonists for the treatment of pain and inflammation. Bioorg Med Chem Lett21:3384-9 (2011) 
 
B1 bradykinin receptor
Name:B1 bradykinin receptor
Type:Enzyme
Mol. Mass.:40508.87
Organism:Homo sapiens (Human)
Description:P46663
Residue:353
BDBM50344105
NameBDBM50344105
Synonyms:2-((R)-4-methyl-3-oxo-1-tosylpiperazin-2-yl)-N-((R)-6-(piperidin-1-ylmethyl)-1,2,3,4-tetrahydronaphthalen-1-yl)acetamide | CHEMBL1777963
TypeSmall organic molecule
Emp. Form.C30H40N4O4S
Mol. Mass.552.728
SMILESCN1CCN([C@H](CC(=O)N[C@@H]2CCCc3cc(CN4CCCCC4)ccc23)C1=O)S(=O)(=O)c1ccc(C)cc1