Reaction Details
TargetB1 bradykinin receptor
LigandBDBM50344095
Substrate/Competitorn/a
Meas. Tech.ChEMBL_748609 (CHEMBL1780462)
IC50 1.76±n/a nM
Citation Chen, JJNguyen, TD'Amico, DCQian, WHuman, JAya, TBiswas, KFotsch, CHan, NLiu, QNishimura, NPeterkin, TAYang, KZhu, JRiahi, BBHungate, RWAndersen, NGColyer, JTFaul, MMKamassah, AWang, JJona, JKumar, GJohnson, EAskew, BC 3-Oxo-2-piperazinyl acetamides as potent bradykinin B1 receptor antagonists for the treatment of pain and inflammation. Bioorg Med Chem Lett21:3384-9 (2011) 
 
B1 bradykinin receptor
Name:B1 bradykinin receptor
Type:Enzyme
Mol. Mass.:40508.87
Organism:Homo sapiens (Human)
Description:P46663
Residue:353
BDBM50344095
NameBDBM50344095
Synonyms:2-(3-oxo-1-(4-(trifluoromethyl)phenylsulfonyl)piperazin-2-yl)-N-((R)-6-(piperidin-1-ylmethyl)-1,2,3,4-tetrahydronaphthalen-1-yl)acetamide | CHEMBL1777887
TypeSmall organic molecule
Emp. Form.C29H35F3N4O4S
Mol. Mass.592.673
SMILESFC(F)(F)c1ccc(cc1)S(=O)(=O)N1CCNC(=O)C1CC(=O)N[C@@H]1CCCc2cc(CN3CCCCC3)ccc12