Reaction Details
TargetB1 bradykinin receptor
LigandBDBM50344097
Substrate/Competitorn/a
Meas. Tech.ChEMBL_748609 (CHEMBL1780462)
IC50 2.3±n/a nM
Citation Chen, JJNguyen, TD'Amico, DCQian, WHuman, JAya, TBiswas, KFotsch, CHan, NLiu, QNishimura, NPeterkin, TAYang, KZhu, JRiahi, BBHungate, RWAndersen, NGColyer, JTFaul, MMKamassah, AWang, JJona, JKumar, GJohnson, EAskew, BC 3-Oxo-2-piperazinyl acetamides as potent bradykinin B1 receptor antagonists for the treatment of pain and inflammation. Bioorg Med Chem Lett21:3384-9 (2011) 
 
B1 bradykinin receptor
Name:B1 bradykinin receptor
Type:Enzyme
Mol. Mass.:40508.87
Organism:Homo sapiens (Human)
Description:P46663
Residue:353
BDBM50344097
NameBDBM50344097
Synonyms:2-(1-(4-methyl-3-(trifluoromethyl)phenylsulfonyl)-3-oxopiperazin-2-yl)-N-((R)-6-(piperidin-1-ylmethyl)-1,2,3,4-tetrahydronaphthalen-1-yl)acetamide | CHEMBL1777955
TypeSmall organic molecule
Emp. Form.C30H37F3N4O4S
Mol. Mass.606.699
SMILESCc1ccc(cc1C(F)(F)F)S(=O)(=O)N1CCNC(=O)C1CC(=O)N[C@@H]1CCCc2cc(CN3CCCCC3)ccc12