Reaction Details
TargetB1 bradykinin receptor
LigandBDBM50344120
Substrate/Competitorn/a
Meas. Tech.ChEMBL_748609 (CHEMBL1780462)
IC50 0.48±n/a nM
Citation Chen, JJNguyen, TD'Amico, DCQian, WHuman, JAya, TBiswas, KFotsch, CHan, NLiu, QNishimura, NPeterkin, TAYang, KZhu, JRiahi, BBHungate, RWAndersen, NGColyer, JTFaul, MMKamassah, AWang, JJona, JKumar, GJohnson, EAskew, BC 3-Oxo-2-piperazinyl acetamides as potent bradykinin B1 receptor antagonists for the treatment of pain and inflammation. Bioorg Med Chem Lett21:3384-9 (2011) 
 
B1 bradykinin receptor
Name:B1 bradykinin receptor
Type:Enzyme
Mol. Mass.:40508.87
Organism:Homo sapiens (Human)
Description:P46663
Residue:353
BDBM50344120
NameBDBM50344120
Synonyms:CHEMBL1777978 | N-((R)-6-((isobutylamino)methyl)-1,2,3,4-tetrahydronaphthalen-1-yl)-2-((R)-3-oxo-1-tosylpiperazin-2-yl)acetamide
TypeSmall organic molecule
Emp. Form.C28H38N4O4S
Mol. Mass.526.691
SMILESCC(C)CNCc1ccc2[C@@H](CCCc2c1)NC(=O)C[C@H]1N(CCNC1=O)S(=O)(=O)c1ccc(C)cc1