Reaction Details
TargetMitogen-activated protein kinase 10
LigandBDBM50341346
Substrate/Competitorn/a
Meas. Tech.ChEMBL_747898 (CHEMBL1781217)
Kd 16±n/a nM
Citation Soth, MAbbot, SAbubakari, AArora, NArzeno, HBilledeau, RDewdney, NDurkin, KFrauchiger, SGhate, MGoldstein, DMHill, RJKuglstatter, ALi, FLoe, BMcCaleb, KMcIntosh, JPapp, EPark, JStahl, MSung, MLSuttman, RSwinney, DCWeller, PWong, BZecic, HGabriel, T 3-Amino-pyrazolo[3,4-d]pyrimidines as p38a kinase inhibitors: design and development to a highly selective lead. Bioorg Med Chem Lett21:3452-6 (2011) 
 
Mitogen-activated protein kinase 10
Name:Mitogen-activated protein kinase 10
Type:Enzyme
Mol. Mass.:52586.89
Organism:Homo sapiens (Human)
Description:n/a
Residue:464
BDBM50341346
NameBDBM50341346
Synonyms:(R)-6-(2,4-difluorophenoxy)-8-methyl-2-(1-(methylsulfonyl)propan-2-ylamino)pyrido[2,3-d]pyrimidin-7(8H)-one 6-(2,4-difluorophenoxy)-8-methyl-2-{[(1R)-1-methyl-2-(methylsulfonyl)ethyl]amino}pyrido[2,3-d]pyrimidin-7(8H)-one | CHEMBL1232769
TypeSmall organic molecule
Emp. Form.C18H18F2N4O4S
Mol. Mass.424.422
SMILESC[C@H](CS(C)(=O)=O)Nc1ncc2cc(Oc3ccc(F)cc3F)c(=O)n(C)c2n1