Reaction Details
TargetMitogen-activated protein kinase 14
LigandBDBM50344128
Substrate/Competitorn/a
Meas. Tech.ChEMBL_747811 (CHEMBL1781010)
IC50 2200±n/a nM
Citation Soth, MAbbot, SAbubakari, AArora, NArzeno, HBilledeau, RDewdney, NDurkin, KFrauchiger, SGhate, MGoldstein, DMHill, RJKuglstatter, ALi, FLoe, BMcCaleb, KMcIntosh, JPapp, EPark, JStahl, MSung, MLSuttman, RSwinney, DCWeller, PWong, BZecic, HGabriel, T 3-Amino-pyrazolo[3,4-d]pyrimidines as p38a kinase inhibitors: design and development to a highly selective lead. Bioorg Med Chem Lett21:3452-6 (2011) 
 
Mitogen-activated protein kinase 14
Name:Mitogen-activated protein kinase 14
Type:Serine/threonine-protein kinase
Mol. Mass.:41286.76
Organism:Homo sapiens (Human)
Description:Q16539
Residue:360
BDBM50344128
NameBDBM50344128
Synonyms:CHEMBL1778185 | [6-(2,4-Difluoro-phenoxy)-1H-pyrazolo[3,4-d]pyrimidin-3-yl]-(1,1-dioxo-hexahydro-1lambda*6*-thiopyran-4-yl)-amine
TypeSmall organic molecule
Emp. Form.C16H15F2N5O3S
Mol. Mass.395.384
SMILESFc1ccc(Oc2ncc3c(NC4CCS(=O)(=O)CC4)[nH]nc3n2)c(F)c1