Reaction Details
TargetMitogen-activated protein kinase 14
LigandBDBM50344137
Substrate/Competitorn/a
Meas. Tech.ChEMBL_747811 (CHEMBL1781010)
IC50 100±n/a nM
Citation Soth, MAbbot, SAbubakari, AArora, NArzeno, HBilledeau, RDewdney, NDurkin, KFrauchiger, SGhate, MGoldstein, DMHill, RJKuglstatter, ALi, FLoe, BMcCaleb, KMcIntosh, JPapp, EPark, JStahl, MSung, MLSuttman, RSwinney, DCWeller, PWong, BZecic, HGabriel, T 3-Amino-pyrazolo[3,4-d]pyrimidines as p38a kinase inhibitors: design and development to a highly selective lead. Bioorg Med Chem Lett21:3452-6 (2011) 
 
Mitogen-activated protein kinase 14
Name:Mitogen-activated protein kinase 14
Type:Serine/threonine-protein kinase
Mol. Mass.:41286.76
Organism:Homo sapiens (Human)
Description:Q16539
Residue:360
BDBM50344137
NameBDBM50344137
Synonyms:CHEMBL1778099 | N-(6-(2,4-difluorophenoxy)-1H-pyrazolo[3,4-d]pyrimidin-3-yl)isobutyramide
TypeSmall organic molecule
Emp. Form.C15H13F2N5O2
Mol. Mass.333.2928
SMILESCC(C)C(=O)Nc1[nH]nc2nc(Oc3ccc(F)cc3F)ncc12