Reaction Details
TargetProstaglandin D2 receptor 2
LigandBDBM50344177
Substrate/Competitorn/a
Meas. Tech.ChEMBL_748139 (CHEMBL1781769)
Ki 126±n/a nM
Citation Zaghdane, HBoyd, MColucci, JSimard, DBerthelette, CLeblanc, YWang, ZHoule, RLévesque, JFMolinaro, CHamel, MStocco, RSawyer, NSillaots, SGervais, FGallant, M New indole amide derivatives as potent CRTH2 receptor antagonists. Bioorg Med Chem Lett21:3471-4 (2011) 
 
Prostaglandin D2 receptor 2
Name:Prostaglandin D2 receptor 2
Type:Enzyme
Mol. Mass.:43295.45
Organism:Homo sapiens (Human)
Description:Q9Y5Y4
Residue:395
BDBM50344177
NameBDBM50344177
Synonyms:(R)-2-(7-(2-(4-fluoro-3-(trifluoromethyl)phenyl)-N-methylacetamido)-6,7,8,9-tetrahydropyrido[1,2-a]indol-10-yl)acetic acid | CHEMBL1778515
TypeSmall organic molecule
Emp. Form.C24H22F4N2O3
Mol. Mass.462.4367
SMILESCN([C@@H]1CCc2c(CC(O)=O)c3ccccc3n2C1)C(=O)Cc1ccc(F)c(c1)C(F)(F)F