Reaction Details
TargetProstaglandin D2 receptor 2
LigandBDBM50344170
Substrate/Competitorn/a
Meas. Tech.ChEMBL_748140 (CHEMBL1781819)
IC50 140±n/a nM
Citation Zaghdane, HBoyd, MColucci, JSimard, DBerthelette, CLeblanc, YWang, ZHoule, RLévesque, JFMolinaro, CHamel, MStocco, RSawyer, NSillaots, SGervais, FGallant, M New indole amide derivatives as potent CRTH2 receptor antagonists. Bioorg Med Chem Lett21:3471-4 (2011) 
 
Prostaglandin D2 receptor 2
Name:Prostaglandin D2 receptor 2
Type:Enzyme
Mol. Mass.:43295.45
Organism:Homo sapiens (Human)
Description:Q9Y5Y4
Residue:395
BDBM50344170
NameBDBM50344170
Synonyms:2-((7R)-7-(N-methyl-1,2,3,4-tetrahydronaphthalene-1-carboxamido)-6,7,8,9-tetrahydropyrido[1,2-a]indol-10-yl)acetic acid | CHEMBL1778508
TypeSmall organic molecule
Emp. Form.C26H28N2O3
Mol. Mass.416.5121
SMILESCN([C@@H]1CCc2c(CC(O)=O)c3ccccc3n2C1)C(=O)C1CCCc2ccccc12