Reaction Details
TargetNeprilysin
LigandBDBM50085452
Substrate/Competitorn/a
Meas. Tech.ChEMBL_748203 (CHEMBL1780284)
IC50 0.6±n/a nM
Citation Glossop, MSBazin, RJDack, KNFox, DNMacDonald, GAMills, MOwen, DRPhillips, CReeves, KARinger, TJStrang, RSWatson, CA Synthesis and evaluation of heteroarylalanine diacids as potent and selective neutral endopeptidase inhibitors. Bioorg Med Chem Lett21:3404-6 (2011) 
 
Neprilysin
Name:Neprilysin
Type:Enzyme
Mol. Mass.:85505.38
Organism:Homo sapiens (Human)
Description:P08473
Residue:750
BDBM50085452
NameBDBM50085452
Synonyms:(S)-2-[((S)-6-Amino-2-methanesulfonylamino-hexanoylamino)-methyl]-3-{1-[(S)-1-carboxy-2-(4-hydroxy-phenyl)-ethylcarbamoyl]-cyclopentyl}-propionic acid Sampatrilat
TypeSmall organic molecule
Emp. Form.C26H40N4O9S
Mol. Mass.584.682
SMILESCS(=O)(=O)N[C@@H](CCCCN)C(=O)NC[C@H](CC1(CCCC1)C(=O)N[C@@H](Cc1ccc(O)cc1)C(O)=O)C(O)=O