Reaction Details
TargetNatriuretic peptides A
LigandBDBM50344190
Substrate/Competitorn/a
Meas. Tech.ChEMBL_748204 (CHEMBL1780285)
IC50 25±n/a nM
Citation Glossop, MSBazin, RJDack, KNFox, DNMacDonald, GAMills, MOwen, DRPhillips, CReeves, KARinger, TJStrang, RSWatson, CA Synthesis and evaluation of heteroarylalanine diacids as potent and selective neutral endopeptidase inhibitors. Bioorg Med Chem Lett21:3404-6 (2011) 
 
Natriuretic peptides A
Name:Natriuretic peptides A
Type:PROTEIN
Mol. Mass.:16393.93
Organism:Homo sapiens (Human)
Description:ChEMBL_748204
Residue:151
BDBM50344190
NameBDBM50344190
Synonyms:(S)-2-(1-((S)-1-carboxy-2-(4-phenyloxazol-2-yl)ethylcarbamoyl)cyclopentylamino)pentanoic acid | CHEMBL1778529
TypeSmall organic molecule
Emp. Form.C23H29N3O6
Mol. Mass.443.4929
SMILESCCC[C@H](NC1(CCCC1)C(=O)N[C@@H](Cc1nc(co1)-c1ccccc1)C(O)=O)C(O)=O