Reaction Details
TargetNatriuretic peptides A
LigandBDBM50344192
Substrate/Competitorn/a
Meas. Tech.ChEMBL_748204 (CHEMBL1780285)
IC50 130±n/a nM
Citation Glossop, MSBazin, RJDack, KNFox, DNMacDonald, GAMills, MOwen, DRPhillips, CReeves, KARinger, TJStrang, RSWatson, CA Synthesis and evaluation of heteroarylalanine diacids as potent and selective neutral endopeptidase inhibitors. Bioorg Med Chem Lett21:3404-6 (2011) 
 
Natriuretic peptides A
Name:Natriuretic peptides A
Type:PROTEIN
Mol. Mass.:16393.93
Organism:Homo sapiens (Human)
Description:ChEMBL_748204
Residue:151
BDBM50344192
NameBDBM50344192
Synonyms:(S)-2-(1-((S)-1-carboxy-2-(4-phenyloxazol-2-yl)ethylcarbamoyl)cyclopentylamino)-4-methoxybutanoic acid | CHEMBL1778531
TypeSmall organic molecule
Emp. Form.C23H29N3O7
Mol. Mass.459.4923
SMILESCOCC[C@H](NC1(CCCC1)C(=O)N[C@@H](Cc1nc(co1)-c1ccccc1)C(O)=O)C(O)=O