Reaction Details
TargetNatriuretic peptides A
LigandBDBM50344196
Substrate/Competitorn/a
Meas. Tech.ChEMBL_748204 (CHEMBL1780285)
IC50>3000±n/a nM
Citation Glossop, MSBazin, RJDack, KNFox, DNMacDonald, GAMills, MOwen, DRPhillips, CReeves, KARinger, TJStrang, RSWatson, CA Synthesis and evaluation of heteroarylalanine diacids as potent and selective neutral endopeptidase inhibitors. Bioorg Med Chem Lett21:3404-6 (2011) 
 
Natriuretic peptides A
Name:Natriuretic peptides A
Type:PROTEIN
Mol. Mass.:16393.93
Organism:Homo sapiens (Human)
Description:ChEMBL_748204
Residue:151
BDBM50344196
NameBDBM50344196
Synonyms:(S)-2-(1-((S)-1-carboxy-2-(5-phenyl-1,3,4-oxadiazol-2-yl)ethylcarbamoyl)cyclopentylamino)-4-methoxybutanoic acid | CHEMBL1778535
TypeSmall organic molecule
Emp. Form.C22H28N4O7
Mol. Mass.460.4803
SMILESCOCC[C@H](NC1(CCCC1)C(=O)N[C@@H](Cc1nnc(o1)-c1ccccc1)C(O)=O)C(O)=O