Reaction Details
TargetALK tyrosine kinase receptor
LigandBDBM50344201
Substrate/Competitorn/a
Meas. Tech.ChEMBL_747826 (CHEMBL1781025)
IC50 89±n/a nM
Citation Okamoto, MKojima, HSaito, NOkabe, TMasuda, YFuruya, TNagano, T Virtual screening and further development of novel ALK inhibitors. Bioorg Med Chem19:3086-95 (2011) 
 
ALK tyrosine kinase receptor
Name:ALK tyrosine kinase receptor
Type:Protein
Mol. Mass.:176453.10
Organism:Homo sapiens (Human)
Description:Q9UM73
Residue:1620
BDBM50344201
NameBDBM50344201
Synonyms:3-[[3-[3-[(2-Aminoethyl)amino]phenyl]]-5-methyl-1Hpyrrol-2-yl]methylene]-1,3-dihydro-2H-indol-2-one | CHEMBL1778722
TypeSmall organic molecule
Emp. Form.C22H22N4O
Mol. Mass.358.4363
SMILESCc1cc(c(\C=C2/C(=O)Nc3ccccc23)[nH]1)-c1cccc(NCCN)c1