Reaction Details
TargetALK tyrosine kinase receptor
LigandBDBM50344202
Substrate/Competitorn/a
Meas. Tech.ChEMBL_747826 (CHEMBL1781025)
IC50 68±n/a nM
Citation Okamoto, MKojima, HSaito, NOkabe, TMasuda, YFuruya, TNagano, T Virtual screening and further development of novel ALK inhibitors. Bioorg Med Chem19:3086-95 (2011) 
 
ALK tyrosine kinase receptor
Name:ALK tyrosine kinase receptor
Type:Protein
Mol. Mass.:176453.10
Organism:Homo sapiens (Human)
Description:Q9UM73
Residue:1620
BDBM50344202
NameBDBM50344202
Synonyms:5-Amino-3-[[3-(4-aminophenyl)-5-methyl-1H-pyrrol-2-yl]methylene]-1,3-dihydro-2H-indol-2-one | CHEMBL1778721
TypeSmall organic molecule
Emp. Form.C20H18N4O
Mol. Mass.330.3831
SMILESCc1cc(c(\C=C2/C(=O)Nc3ccc(N)cc23)[nH]1)-c1ccc(N)cc1