Reaction Details
TargetALK tyrosine kinase receptor
LigandBDBM50344205
Substrate/Competitorn/a
Meas. Tech.ChEMBL_747826 (CHEMBL1781025)
IC50 62±n/a nM
Citation Okamoto, MKojima, HSaito, NOkabe, TMasuda, YFuruya, TNagano, T Virtual screening and further development of novel ALK inhibitors. Bioorg Med Chem19:3086-95 (2011) 
 
ALK tyrosine kinase receptor
Name:ALK tyrosine kinase receptor
Type:Protein
Mol. Mass.:176453.10
Organism:Homo sapiens (Human)
Description:Q9UM73
Residue:1620
BDBM50344205
NameBDBM50344205
Synonyms:3-[[3-(3-Aminophenyl)-5-methyl-1H-pyrrol-2-yl]methylene]-1,3-dihydro-2H-indol-2-one | CHEMBL1778718
TypeSmall organic molecule
Emp. Form.C20H17N3O
Mol. Mass.315.3685
SMILESCc1cc(c(\C=C2/C(=O)Nc3ccccc23)[nH]1)-c1cccc(N)c1