Reaction Details
TargetGlutamate receptor ionotropic, NMDA 2B
LigandBDBM50344236
Substrate/Competitorn/a
Meas. Tech.ChEMBL_748229 (CHEMBL1781192)
Ki 217±n/a nM
Citation Brown, DGMaier, DLSylvester, MAHoerter, TNMenhaji-Klotz, ELasota, CCHirata, LTWilkins, DEScott, CWTrivedi, SChen, TMcCarthy, DJMaciag, CMSutton, EJCumberledge, JMathisen, DRoberts, JGupta, ALiu, FElmore, CSAlhambra, CKrumrine, JRWang, XCiaccio, PJWood, MWCampbell, JBJohansson, MJXia, JWen, XJiang, JWang, XPeng, ZHu, TWang, J 2,6-Disubstituted pyrazines and related analogs as NR2B site antagonists of the NMDA receptor with anti-depressant activity. Bioorg Med Chem Lett21:3399-403 (2011) 
 
Glutamate receptor ionotropic, NMDA 2B
Name:Glutamate receptor ionotropic, NMDA 2B
Type:Protein
Mol. Mass.:166077.66
Organism:Rattus norvegicus (Rat)
Description:Q00960
Residue:1482
BDBM50344236
NameBDBM50344236
Synonyms:CHEMBL1778869 | N-((6-(4-fluoro-2-methoxyphenyl)pyrazin-2-yl)methyl)-2-methylpropan-1-amine
TypeSmall organic molecule
Emp. Form.C16H20FN3O
Mol. Mass.289.3479
SMILESCOc1cc(F)ccc1-c1cncc(CNCC(C)C)n1