Reaction Details
TargetMuscarinic acetylcholine receptor M2
LigandBDBM50344270
Substrate/Competitorn/a
Meas. Tech.ChEMBL_748301 (CHEMBL1781311)
IC50 1.8±n/a nM
Citation Prat, MBuil, MAFernández, MDCastro, JMonleón, JMTort, LCasals, GFerrer, MHuerta, JMEspinosa, SLópez, MSegarra, VGavaldà, AMiralpeix, MRamos, IVilella, DGonzález, MCórdoba, MCárdenas, AAntón, FBeleta, JRyder, H Discovery of novel quaternary ammonium derivatives of (3R)-quinuclidinyl carbamates as potent and long acting muscarinic antagonists. Bioorg Med Chem Lett21:3457-61 (2011) 
 
Muscarinic acetylcholine receptor M2
Name:Muscarinic acetylcholine receptor M2
Type:GPCR
Mol. Mass.:51730.61
Organism:Homo sapiens (Human)
Description:P08172
Residue:466
BDBM50344270
NameBDBM50344270
Synonyms:(R)-quinuclidin-3-yl phenyl(thiophen-2-ylmethyl)carbamate | CHEMBL1779033
TypeSmall organic molecule
Emp. Form.C19H22N2O2S
Mol. Mass.342.455
SMILESO=C(O[C@H]1CN2CCC1CC2)N(Cc1cccs1)c1ccccc1