Reaction Details
TargetcAMP-specific 3',5'-cyclic phosphodiesterase 4B
LigandBDBM50344312
Substrate/Competitorn/a
Meas. Tech.ChEMBL_748499 (CHEMBL1780352)
IC50 11000±n/a nM
Citation Allcock, RWBlakli, HJiang, ZJohnston, KAMorgan, KMRosair, GMIwase, KKohno, YAdams, DR Phosphodiesterase inhibitors. Part 1: Synthesis and structure-activity relationships of pyrazolopyridine-pyridazinone PDE inhibitors developed from ibudilast. Bioorg Med Chem Lett21:3307-12 (2011) 
 
cAMP-specific 3',5'-cyclic phosphodiesterase 4B
Name:cAMP-specific 3',5'-cyclic phosphodiesterase 4B
Type:Protein
Mol. Mass.:83318.87
Organism:Homo sapiens (Human)
Description:Q07343
Residue:736
BDBM50344312
NameBDBM50344312
Synonyms:CHEMBL1779430 | rac-2-Benzyl-4,4a,5,6-tetrahydro-2H-1,2,7,7a-tetraaza-benzo[c]fluoren-3-one
TypeSmall organic molecule
Emp. Form.C20H18N4O
Mol. Mass.330.3831
SMILESO=C1CC2CCc3nn4ccccc4c3C2=NN1Cc1ccccc1