Reaction Details
TargetcAMP-specific 3',5'-cyclic phosphodiesterase 4B
LigandBDBM50344318
Substrate/Competitorn/a
Meas. Tech.ChEMBL_748499 (CHEMBL1780352)
IC50 2500±n/a nM
Citation Allcock, RWBlakli, HJiang, ZJohnston, KAMorgan, KMRosair, GMIwase, KKohno, YAdams, DR Phosphodiesterase inhibitors. Part 1: Synthesis and structure-activity relationships of pyrazolopyridine-pyridazinone PDE inhibitors developed from ibudilast. Bioorg Med Chem Lett21:3307-12 (2011) 
 
cAMP-specific 3',5'-cyclic phosphodiesterase 4B
Name:cAMP-specific 3',5'-cyclic phosphodiesterase 4B
Type:Protein
Mol. Mass.:83318.87
Organism:Homo sapiens (Human)
Description:Q07343
Residue:736
BDBM50344318
NameBDBM50344318
Synonyms:CHEMBL1779436 | rac-9-Benzyl-1-isopropyl-6a,9,10b,10c-tetrahydro-6H,7H-2,2a,9,10-tetraaza-aceanthrylen-8-one
TypeSmall organic molecule
Emp. Form.C22H22N4O
Mol. Mass.358.4363
SMILESCC(C)c1nn2cccc3CC4CC(=O)N(Cc5ccccc5)N=C4c1c23