Reaction Details
TargetcAMP-specific 3',5'-cyclic phosphodiesterase 4B
LigandBDBM50344328
Substrate/Competitorn/a
Meas. Tech.ChEMBL_748499 (CHEMBL1780352)
IC50 2610±n/a nM
Citation Allcock, RWBlakli, HJiang, ZJohnston, KAMorgan, KMRosair, GMIwase, KKohno, YAdams, DR Phosphodiesterase inhibitors. Part 1: Synthesis and structure-activity relationships of pyrazolopyridine-pyridazinone PDE inhibitors developed from ibudilast. Bioorg Med Chem Lett21:3307-12 (2011) 
 
cAMP-specific 3',5'-cyclic phosphodiesterase 4B
Name:cAMP-specific 3',5'-cyclic phosphodiesterase 4B
Type:Protein
Mol. Mass.:83318.87
Organism:Homo sapiens (Human)
Description:Q07343
Residue:736
BDBM50344328
NameBDBM50344328
Synonyms:6-(2-isopropyl-7-methoxypyrazolo[1,5-a]pyridin-4-yl)-4,5-dihydropyridazin-3(2H)-one | CHEMBL1779446
TypeSmall organic molecule
Emp. Form.C15H18N4O2
Mol. Mass.286.329
SMILESCOc1ccc(C2=NNC(=O)CC2)c2cc(nn12)C(C)C