Reaction Details
TargetSynaptic vesicular amine transporter
LigandBDBM50344442
Substrate/Competitorn/a
Meas. Tech.ChEMBL_747720 (CHEMBL1780875)
Ki 137±n/a nM
Citation Zheng, PLieberman, BPChoi, SRPlöessl, KKung, HF Synthesis and biological evaluation of 3-alkyl-dihydrotetrabenazine derivatives as vesicular monoamine transporter-2 (VMAT2) ligands. Bioorg Med Chem Lett21:3435-8 (2011) 
 
Synaptic vesicular amine transporter
Name:Synaptic vesicular amine transporter
Type:Protein
Mol. Mass.:55689.58
Organism:Rattus norvegicus (Rat)
Description:Q01827
Residue:515
BDBM50344442
NameBDBM50344442
Synonyms:CHEMBL1780008 | rac-(2R)-3-(cyclohexylmethyl)-9,10-dimethoxy-2,3,4,6,7,11b-hexahydro-1H-pyrido[2,1-a]isoquinolin-2-ol
TypeSmall organic molecule
Emp. Form.C22H33NO3
Mol. Mass.359.5023
SMILESCOc1cc2CCN3CC(CC4CCCCC4)[C@H](O)CC3c2cc1OC