Reaction Details
TargetPlasmepsin II
LigandBDBM50344447
Substrate/Competitorn/a
Meas. Tech.ChEMBL_747699 (CHEMBL1780854)
Ki 2000±n/a nM
Citation McKay, PBPeters, MBCarta, GFlood, CTDempsey, EBell, ABerry, CLloyd, DGFayne, D Identification of plasmepsin inhibitors as selective anti-malarial agents using ligand based drug design. Bioorg Med Chem Lett21:3335-41 (2011) 
 
Plasmepsin II
Name:Plasmepsin II
Type:Enzyme
Mol. Mass.:51482.09
Organism:Plasmodium falciparum
Description:P46925
Residue:453
BDBM50344447
NameBDBM50344447
Synonyms:CHEMBL1780016 | methyl-5-(diethylcarbamoyl)-4-methyl-2-(2-m-tolylquinoline-4-carboxamido)thiophene-3-carboxylate
TypeSmall organic molecule
Emp. Form.C29H29N3O4S
Mol. Mass.515.623
SMILESCCN(CC)C(=O)c1sc(NC(=O)c2cc(nc3ccccc23)-c2cccc(C)c2)c(C(=O)OC)c1C