Reaction Details
TargetRAF proto-oncogene serine/threonine-protein kinase
LigandBDBM50344527
Substrate/Competitorn/a
Meas. Tech.ChEMBL_747956 (CHEMBL1781333)
IC50 3±n/a nM
Citation Ramurthy, SAikawa, MAmiri, PCostales, AHashash, AJansen, JMLin, SMa, SRenhowe, PAShafer, CMSubramanian, SSung, LVerhagen, J Design and synthesis of 5,6-fused heterocyclic amides as Raf kinase inhibitors. Bioorg Med Chem Lett21:3286-9 (2011) 
 
RAF proto-oncogene serine/threonine-protein kinase
Name:RAF proto-oncogene serine/threonine-protein kinase
Type:Serine/threonine-protein kinase
Mol. Mass.:73082.52
Organism:Homo sapiens (Human)
Description:P04049
Residue:648
BDBM50344527
NameBDBM50344527
Synonyms:4-(2-(4-isopropylphenylamino)benzo[d]thiazol-5-yloxy)-N-methylpicolinamide | CHEMBL1778408
TypeSmall organic molecule
Emp. Form.C23H22N4O2S
Mol. Mass.418.511
SMILESCNC(=O)c1cc(Oc2ccc3sc(Nc4ccc(cc4)C(C)C)nc3c2)ccn1