Reaction Details
TargetCarbonic anhydrase 1
LigandBDBM50344553
Substrate/Competitorn/a
Meas. Tech.ChEMBL_748113 (CHEMBL1781743)
Ki 15±n/a nM
Citation Mincione, FBenedini, FBiondi, SCecchi, ATemperini, CFormicola, GPacileo, IScozzafava, AMasini, ESupuran, CT Synthesis and crystallographic analysis of new sulfonamides incorporating NO-donating moieties with potent antiglaucoma action. Bioorg Med Chem Lett21:3216-21 (2011) 
 
Carbonic anhydrase 1
Name:Carbonic anhydrase 1
Type:Enzyme
Mol. Mass.:28873.37
Organism:Homo sapiens (Human)
Description:P00915
Residue:261
BDBM50344553
NameBDBM50344553
Synonyms:2-methoxy-4-(3-(4-(nitrooxy)butoxy)-3-oxoprop-1-enyl)phenyl-4-sulfamoylbenzoate | CHEMBL1778433
TypeSmall organic molecule
Emp. Form.C21H22N2O10S
Mol. Mass.494.472
SMILESCOc1cc(\C=C\C(=O)OCCCCO[N+]([O-])=O)ccc1OC(=O)c1ccc(cc1)S(N)(=O)=O