Reaction Details
TargetCarbonic anhydrase 1
LigandBDBM50344556
Substrate/Competitorn/a
Meas. Tech.ChEMBL_748113 (CHEMBL1781743)
Ki 32±n/a nM
Citation Mincione, FBenedini, FBiondi, SCecchi, ATemperini, CFormicola, GPacileo, IScozzafava, AMasini, ESupuran, CT Synthesis and crystallographic analysis of new sulfonamides incorporating NO-donating moieties with potent antiglaucoma action. Bioorg Med Chem Lett21:3216-21 (2011) 
 
Carbonic anhydrase 1
Name:Carbonic anhydrase 1
Type:Enzyme
Mol. Mass.:28873.37
Organism:Homo sapiens (Human)
Description:P00915
Residue:261
BDBM50344556
NameBDBM50344556
Synonyms:4-(nitrooxy)butyl 4-(N-(5-sulfamoyl-1,3,4-thiadiazol-2-yl)sulfamoyl)benzoate | CHEMBL1778435
TypeSmall organic molecule
Emp. Form.C13H15N5O9S3
Mol. Mass.481.481
SMILESNS(=O)(=O)c1nnc(NS(=O)(=O)c2ccc(cc2)C(=O)OCCCCO[N+]([O-])=O)s1