Reaction Details
TargetCarbonic anhydrase 1
LigandBDBM50344558
Substrate/Competitorn/a
Meas. Tech.ChEMBL_748113 (CHEMBL1781743)
Ki 395±n/a nM
Citation Mincione, FBenedini, FBiondi, SCecchi, ATemperini, CFormicola, GPacileo, IScozzafava, AMasini, ESupuran, CT Synthesis and crystallographic analysis of new sulfonamides incorporating NO-donating moieties with potent antiglaucoma action. Bioorg Med Chem Lett21:3216-21 (2011) 
 
Carbonic anhydrase 1
Name:Carbonic anhydrase 1
Type:Enzyme
Mol. Mass.:28873.37
Organism:Homo sapiens (Human)
Description:P00915
Residue:261
BDBM50344558
NameBDBM50344558
Synonyms:4-(nitrooxy)butyl 3-(3-methoxy-4-(3-(4-sulfamoylphenyl)propanoyloxy)phenyl)acrylate | CHEMBL1778437
TypeSmall organic molecule
Emp. Form.C23H26N2O10S
Mol. Mass.522.525
SMILESCOc1cc(\C=C\C(=O)OCCCCO[N+]([O-])=O)ccc1OC(=O)CCc1ccc(cc1)S(N)(=O)=O