Reaction Details
TargetCarbonic anhydrase 2
LigandBDBM50344561
Substrate/Competitorn/a
Meas. Tech.ChEMBL_748114 (CHEMBL1781744)
Ki 71±n/a nM
Citation Mincione, FBenedini, FBiondi, SCecchi, ATemperini, CFormicola, GPacileo, IScozzafava, AMasini, ESupuran, CT Synthesis and crystallographic analysis of new sulfonamides incorporating NO-donating moieties with potent antiglaucoma action. Bioorg Med Chem Lett21:3216-21 (2011) 
 
Carbonic anhydrase 2
Name:Carbonic anhydrase 2
Type:Enzyme
Mol. Mass.:29250.71
Organism:Homo sapiens (Human)
Description:P00918
Residue:260
BDBM50344561
NameBDBM50344561
Synonyms:5-(4-sulfamoylphenoxy)pentyl nitrate | CHEMBL1778439
TypeSmall organic molecule
Emp. Form.C11H16N2O6S
Mol. Mass.304.32
SMILESNS(=O)(=O)c1ccc(OCCCCCO[N+]([O-])=O)cc1