Reaction Details
TargetCarbonic anhydrase 9
LigandBDBM50344555
Substrate/Competitorn/a
Meas. Tech.ChEMBL_748165 (CHEMBL1781844)
Ki 177±n/a nM
Citation Mincione, FBenedini, FBiondi, SCecchi, ATemperini, CFormicola, GPacileo, IScozzafava, AMasini, ESupuran, CT Synthesis and crystallographic analysis of new sulfonamides incorporating NO-donating moieties with potent antiglaucoma action. Bioorg Med Chem Lett21:3216-21 (2011) 
 
Carbonic anhydrase 9
Name:Carbonic anhydrase 9
Type:Enzyme
Mol. Mass.:49669.03
Organism:Homo sapiens (Human)
Description:Catalytic domain of human cloned isozyme was used in the assay
Residue:459
BDBM50344555
NameBDBM50344555
Synonyms:2-methoxy-4-(3-(4-(nitrooxy)butoxy)-3-oxoprop-1-enyl)phenyl 3-(N-(5-sulfamoyl-1,3,4-thiadiazol-2-yl)sulfamoyl)benzoate | CHEMBL1778434
TypeSmall organic molecule
Emp. Form.C23H23N5O12S3
Mol. Mass.657.65
SMILESCOc1cc(\C=C\C(=O)OCCCCO[N+]([O-])=O)ccc1OC(=O)c1cccc(c1)S(=O)(=O)Nc1nnc(s1)S(N)(=O)=O