Reaction Details
TargetSigma non-opioid intracellular receptor 1
LigandBDBM50170660
Substrate/Competitorn/a
Meas. Tech.ChEMBL_748962 (CHEMBL1781410)
Ki 1.03±n/a nM
Citation Banister, SDMoussa, IAJorgensen, WTChua, SWKassiou, M Molecular hybridization of 4-azahexacyclo[5.4.1.0(2,6).0(3,10).0(5,9).0(8,11)]dodecane-3-ol with sigma (s) receptor ligands modulates off-target activity and subtype selectivity. Bioorg Med Chem Lett21:3622-6 (2011) 
 
Sigma non-opioid intracellular receptor 1
Name:Sigma non-opioid intracellular receptor 1
Type:Enzyme Catalytic Domain
Mol. Mass.:25266.54
Organism:RAT
Description:Q9R0C9
Residue:223
BDBM50170660
NameBDBM50170660
Synonyms:CHEMBL190883 N,N-dipropyl-2-[4-methoxy-3-(2-phenylethoxy)phenyl]ethylamine NE-100 | [2-(4-Methoxy-3-phenethyloxy-phenyl)-ethyl]-dipropyl-amine
TypeSmall organic molecule
Emp. Form.C23H33NO2
Mol. Mass.355.5136
SMILESCCCN(CCC)CCc1ccc(OC)c(OCCc2ccccc2)c1