Reaction Details
TargetALK tyrosine kinase receptor
LigandBDBM50344646
Substrate/Competitorn/a
Meas. Tech.ChEMBL_748985 (CHEMBL1781770)
IC50 2470±n/a nM
Citation Kinoshita, KOno, YEmura, TAsoh, KFuruichi, NIto, TKawada, HTanaka, SMorikami, KTsukaguchi, TSakamoto, HTsukuda, TOikawa, N Discovery of novel tetracyclic compounds as anaplastic lymphoma kinase inhibitors. Bioorg Med Chem Lett21:3788-93 (2011) 
 
ALK tyrosine kinase receptor
Name:ALK tyrosine kinase receptor
Type:Protein
Mol. Mass.:176453.10
Organism:Homo sapiens (Human)
Description:Q9UM73
Residue:1620
BDBM50344646
NameBDBM50344646
Synonyms:8-(2-(diethylamino)ethoxy)-6,6-dimethyl-3-propoxybenzo[d]naphtho[2,3-b]furan-11(6H)-one | CHEMBL1779184
TypeSmall organic molecule
Emp. Form.C27H33NO4
Mol. Mass.435.5552
SMILESCCCOc1ccc2c3c(oc2c1)C(C)(C)c1cc(OCCN(CC)CC)ccc1C3=O