Reaction Details
TargetALK tyrosine kinase receptor
LigandBDBM50344647
Substrate/Competitorn/a
Meas. Tech.ChEMBL_748985 (CHEMBL1781770)
IC50 850±n/a nM
Citation Kinoshita, KOno, YEmura, TAsoh, KFuruichi, NIto, TKawada, HTanaka, SMorikami, KTsukaguchi, TSakamoto, HTsukuda, TOikawa, N Discovery of novel tetracyclic compounds as anaplastic lymphoma kinase inhibitors. Bioorg Med Chem Lett21:3788-93 (2011) 
 
ALK tyrosine kinase receptor
Name:ALK tyrosine kinase receptor
Type:Protein
Mol. Mass.:176453.10
Organism:Homo sapiens (Human)
Description:Q9UM73
Residue:1620
BDBM50344647
NameBDBM50344647
Synonyms:8-(2-(diethylamino)ethoxy)-3-fluoro-6,6-dimethylbenzo[d]naphtho[2,3-b]furan-11(6H)-one | CHEMBL1779185
TypeSmall organic molecule
Emp. Form.C24H26FNO3
Mol. Mass.395.4665
SMILESCCN(CC)CCOc1ccc2C(=O)c3c(oc4cc(F)ccc34)C(C)(C)c2c1