Reaction Details
TargetALK tyrosine kinase receptor
LigandBDBM50344654
Substrate/Competitorn/a
Meas. Tech.ChEMBL_748985 (CHEMBL1781770)
IC50 8±n/a nM
Citation Kinoshita, KOno, YEmura, TAsoh, KFuruichi, NIto, TKawada, HTanaka, SMorikami, KTsukaguchi, TSakamoto, HTsukuda, TOikawa, N Discovery of novel tetracyclic compounds as anaplastic lymphoma kinase inhibitors. Bioorg Med Chem Lett21:3788-93 (2011) 
 
ALK tyrosine kinase receptor
Name:ALK tyrosine kinase receptor
Type:Protein
Mol. Mass.:176453.10
Organism:Homo sapiens (Human)
Description:Q9UM73
Residue:1620
BDBM50344654
NameBDBM50344654
Synonyms:8-(2-(diethylamino)ethoxy)-6,6-dimethyl-11-oxo-6,11-dihydro-5H-benzo[b]carbazole-3-carbonitrile | CHEMBL1779192
TypeSmall organic molecule
Emp. Form.C25H27N3O2
Mol. Mass.401.5008
SMILESCCN(CC)CCOc1ccc2C(=O)c3c([nH]c4cc(ccc34)C#N)C(C)(C)c2c1